catapult-n
type: LexicalEntry
canonical form: catapult
sense: 02985687-n
part of speech: noun

launcher-n
type: LexicalEntry
canonical form: launcher
sense: 02985687-n
part of speech: noun

02985687-n
type: LexicalConcept
in scheme: en-word.net
definition: a device that launches aircraft from a warship
ili: i51634
lexfile: noun.artifact
part of speech: noun
hypernym: 03187746-n