cash register-n
type: LexicalEntry
canonical form: cash register
sense: 02980897-n
part of speech: noun

register-n
type: LexicalEntry
canonical form: register
sense: 02980897-n
part of speech: noun

02980897-n
type: LexicalConcept
in scheme: en-word.net
definition: a cashbox with an adding machine to register transactions; used in shops to add up the bill
ili: i51605
lexfile: noun.artifact
part of speech: noun
hypernym: 02980398-n
mero part: 02682111-n