cartridge-n
type: LexicalEntry
canonical form: cartridge
sense: 02975399-n
part of speech: noun

pickup-n
type: LexicalEntry
canonical form: pickup
sense: 02975399-n
part of speech: noun

02975399-n
type: LexicalConcept
in scheme: en-word.net
definition: an electro-acoustic transducer that is the part of the arm of a record player that holds the needle and that is removable
ili: i51573
lexfile: noun.artifact
part of speech: noun
hypernym: 03279472-n
mero part: 04353757-n