cap-n
type: LexicalEntry
canonical form: cap
sense: 02958501-n
part of speech: noun

02958501-n
type: LexicalConcept
in scheme: en-word.net
definition: something serving as a cover or protection
ili: i51475
lexfile: noun.artifact
part of speech: noun
hypernym: 04020673-n