camouflage-n
type: LexicalEntry
canonical form: camouflage
sense: 02948034-n
part of speech: noun

camo-n
type: LexicalEntry
canonical form: camo
sense: 02948034-n
part of speech: noun

02948034-n
type: LexicalConcept
in scheme: en-word.net
definition: fabric dyed with splotches of green and brown and black and tan; intended to make the wearer of a garment made of this fabric hard to distinguish from the background
ili: i51412
lexfile: noun.artifact
part of speech: noun
hypernym: 03314753-n