camouflage-n
type: LexicalEntry
canonical form: camouflage
sense: 02947914-n
part of speech: noun

02947914-n
type: LexicalConcept
in scheme: en-word.net
definition: device or stratagem for concealment or deceit
ili: i51411
lexfile: noun.artifact
part of speech: noun
hypernym: 04159023-n