bow-n-1
type: LexicalEntry
canonical form: bow
sense: 02882759-n
part of speech: noun

02882759-n
type: LexicalConcept
in scheme: en-word.net
definition: a slightly curved piece of resilient wood with taut horsehair strands; used in playing certain stringed instruments
ili: i51013
lexfile: noun.artifact
part of speech: noun
hypernym: 04324558-n