blinker-n
type: LexicalEntry
canonical form: blinker
sense: 02855432-n
part of speech: noun

flasher-n
type: LexicalEntry
canonical form: flasher
sense: 02855432-n
part of speech: noun

02855432-n
type: LexicalConcept
in scheme: en-word.net
definition: a light that flashes on and off; used as a signal or to send messages
ili: i50849
lexfile: noun.artifact
part of speech: noun
hypernym: 03670692-n