blind-n
type: LexicalEntry
canonical form: blind
sense: 02854643-n
part of speech: noun

02854643-n
type: LexicalConcept
in scheme: en-word.net
definition: a hiding place sometimes used by hunters (especially duck hunters)
example: he waited impatiently in the blind
ili: i50843
lexfile: noun.artifact
part of speech: noun
hypernym: 04159023-n