blind-n
type: LexicalEntry
canonical form: blind
sense: 02854358-n
part of speech: noun

screen-n
type: LexicalEntry
canonical form: screen
sense: 02854358-n
part of speech: noun

02854358-n
type: LexicalConcept
in scheme: en-word.net
definition: a protective covering that keeps things out or hinders sight
example: they had just moved in and had not put up blinds yet
ili: i50842
lexfile: noun.artifact
part of speech: noun
hypernym: 04020673-n