binding-n
type: LexicalEntry
canonical form: binding
sense: 02844156-n
part of speech: noun

02844156-n
type: LexicalConcept
in scheme: en-word.net
definition: strip sewn over or along an edge for reinforcement or decoration
ili: i50776
lexfile: noun.artifact
part of speech: noun
hypernym: 04186446-n