bed-n
type: LexicalEntry
canonical form: bed
sense: 02822609-n
part of speech: noun

02822609-n
type: LexicalConcept
in scheme: en-word.net
definition: a plot of ground in which plants are growing
example: the gardener planted a bed of roses
ili: i50636
lexfile: noun.artifact
part of speech: noun
hypernym: 08692477-n