bazaar-n
type: LexicalEntry
canonical form: bazaar
sense: 02816780-n
part of speech: noun

bazar-n
type: LexicalEntry
canonical form: bazar
sense: 02816780-n
part of speech: noun

02816780-n
type: LexicalConcept
in scheme: en-word.net
definition: a street of small shops (especially in Orient)
ili: i50599
lexfile: noun.artifact
part of speech: noun
hypernym: 03727779-n