battery-n
type: LexicalEntry
canonical form: battery
sense: 02813606-n
part of speech: noun

electric battery-n
type: LexicalEntry
canonical form: electric battery
sense: 02813606-n
part of speech: noun

02813606-n
type: LexicalConcept
in scheme: en-word.net
definition: a device that produces electricity; may have several primary or secondary cells arranged in parallel or series
ili: i50578
lexfile: noun.artifact
part of speech: noun
hypernym: 03274312-n
mero part: 03279707-n
mero part: 04420286-n