ignite-v
type: LexicalEntry
canonical form: ignite
sense: 02765572-v
part of speech: verb

light-v
type: LexicalEntry
canonical form: light
sense: 02765572-v
part of speech: verb

02765572-v
type: LexicalConcept
in scheme: en-word.net
definition: cause to start burning; subject to fire or great heat
example: Great heat can ignite almost any dry matter
example: Light a cigarette
ili: i35480
lexfile: verb.weather
part of speech: verb
causes: 00377673-v
hypernym: 02768426-v