continue-v
type: LexicalEntry
canonical form: continue
sense: 02753797-v
part of speech: verb

persist in-v
type: LexicalEntry
canonical form: persist in
sense: 02753797-v
part of speech: verb

02753797-v
type: LexicalConcept
in scheme: en-word.net
definition: do something repeatedly and showing no intention to stop
example: We continued our research into the cause of the illness
example: The landlord persists in asking us to move
ili: i35414
lexfile: verb.stative
part of speech: verb
hypernym: 02372362-v
similar: 02415305-v