assembly-n
type: LexicalEntry
canonical form: assembly
sense: 02752795-n
part of speech: noun

02752795-n
type: LexicalConcept
in scheme: en-word.net
definition: a group of machine parts that fit together to form a self-contained unit
ili: i50215
lexfile: noun.artifact
part of speech: noun
hypernym: 03705309-n