end-v
type: LexicalEntry
canonical form: end
sense: 02741293-v
part of speech: verb

terminate-v
type: LexicalEntry
canonical form: terminate
sense: 02741293-v
part of speech: verb

02741293-v
type: LexicalConcept
in scheme: en-word.net
definition: be the end of; be the last or concluding part of
example: This sad scene ended the movie
ili: i35345
lexfile: verb.stative
part of speech: verb
hypernym: 02609706-v