lie-v
type: LexicalEntry
canonical form: lie
sense: 02740213-v
part of speech: verb

02740213-v
type: LexicalConcept
in scheme: en-word.net
definition: be and remain in a particular state or condition
example: lie dormant
ili: i35338
lexfile: verb.stative
part of speech: verb
hypernym: 02661230-v