arena-n
type: LexicalEntry
canonical form: arena
sense: 02739516-n
part of speech: noun

scene of action-n
type: LexicalEntry
canonical form: scene of action
sense: 02739516-n
part of speech: noun

02739516-n
type: LexicalConcept
in scheme: en-word.net
definition: a playing field where sports events take place
ili: i50138
lexfile: noun.artifact
part of speech: noun
hypernym: 08588287-n