leave-v
type: LexicalEntry
canonical form: leave
sense: 02735289-v
part of speech: verb

02735289-v
type: LexicalConcept
in scheme: en-word.net
definition: act or be so as to become in a specified state
example: The inflation left them penniless
example: The president's remarks left us speechless
ili: i35311
lexfile: verb.stative
part of speech: verb
hypernym: 00120124-v
similar: 02641740-v