help oneself-v
type: LexicalEntry
canonical form: help oneself
sense: 02732039-v
part of speech: verb

help-v
type: LexicalEntry
canonical form: help
sense: 02732039-v
part of speech: verb

02732039-v
type: LexicalConcept
in scheme: en-word.net
definition: abstain from doing; always used with a negative
example: I can't help myself — I have to smoke
example: She could not help watching the sad spectacle
ili: i35297
lexfile: verb.stative
part of speech: verb
hypernym: 02731589-v