squat-v
type: LexicalEntry
canonical form: squat
sense: 02731437-v
part of speech: verb

02731437-v
type: LexicalConcept
in scheme: en-word.net
definition: be close to the earth, or be disproportionately wide
example: The building squatted low
ili: i35294
lexfile: verb.stative
part of speech: verb
hypernym: 02661230-v