follow-v
type: LexicalEntry
canonical form: follow
sense: 02726024-v
part of speech: verb

fall out-v
type: LexicalEntry
canonical form: fall out
sense: 02726024-v
part of speech: verb

02726024-v
type: LexicalConcept
in scheme: en-word.net
definition: come as a logical consequence; follow logically
example: It follows that your assertion is false
example: the theorem falls out nicely
ili: i35265
lexfile: verb.stative
part of speech: verb
hypernym: 02640346-v