album-n
type: LexicalEntry
canonical form: album
sense: 02697938-n
part of speech: noun

02697938-n
type: LexicalConcept
in scheme: en-word.net
definition: a book of blank pages with pockets or envelopes; for organizing photographs or stamp collections etc
ili: i49921
lexfile: noun.artifact
part of speech: noun
hypernym: 02873453-n