air transportation system-n
type: LexicalEntry
canonical form: air transportation system
sense: 02696568-n
part of speech: noun

02696568-n
type: LexicalConcept
in scheme: en-word.net
definition: a transportation system for moving passengers or goods by air
ili: i49912
lexfile: noun.artifact
part of speech: noun
hypernym: 04480667-n