radiate-v
type: LexicalEntry
canonical form: radiate
sense: 02692794-v
part of speech: verb

ray-v
type: LexicalEntry
canonical form: ray
sense: 02692794-v
part of speech: verb

02692794-v
type: LexicalConcept
in scheme: en-word.net
definition: extend or spread outward from a center or focus or inward towards a center
example: spokes radiate from the hub of the wheel
example: This plants radiate spines in all directions
ili: i35088
lexfile: verb.stative
part of speech: verb
hypernym: 02691775-v