admixture-n
type: LexicalEntry
canonical form: admixture
sense: 02683938-n
part of speech: noun

intermixture-n
type: LexicalEntry
canonical form: intermixture
sense: 02683938-n
part of speech: noun

02683938-n
type: LexicalConcept
in scheme: en-word.net
definition: an additional ingredient that is added by mixing with the base
example: the growing medium should be equal parts of sand and loam with an admixture of peat moss and cow manure
example: a large intermixture of sand
ili: i49841
lexfile: noun.artifact
part of speech: noun
hypernym: 03575860-n