adapter-n
type: LexicalEntry
canonical form: adapter
sense: 02681751-n
part of speech: noun

adaptor-n
type: LexicalEntry
canonical form: adaptor
sense: 02681751-n
part of speech: noun

02681751-n
type: LexicalConcept
in scheme: en-word.net
definition: device that enables something to be used in a way different from that for which it was intended or makes different pieces of apparatus compatible
ili: i49829
lexfile: noun.artifact
part of speech: noun
hypernym: 03187746-n