imitate-v
type: LexicalEntry
canonical form: imitate
sense: 02680690-v
part of speech: verb

02680690-v
type: LexicalConcept
in scheme: en-word.net
definition: appear like, as in behavior or appearance
example: Life imitates art
ili: i35036
lexfile: verb.stative
part of speech: verb
hypernym: 02671359-v