rank-v
type: LexicalEntry
canonical form: rank
sense: 02679633-v
part of speech: verb

outrank-v
type: LexicalEntry
canonical form: outrank
sense: 02679633-v
part of speech: verb

02679633-v
type: LexicalConcept
in scheme: en-word.net
definition: take precedence or surpass others in rank
ili: i35029
lexfile: verb.stative
part of speech: verb
hypernym: 02679754-v