depend on-v
type: LexicalEntry
canonical form: depend on
sense: 02669926-v
part of speech: verb

rely on-v
type: LexicalEntry
canonical form: rely on
sense: 02669926-v
part of speech: verb

02669926-v
type: LexicalConcept
in scheme: en-word.net
definition: be dependent on, as for support or maintenance
example: elderly parents often depend on their adult children
ili: i34983
lexfile: verb.stative
part of speech: verb
hypernym: 02634015-v