hover-v
type: LexicalEntry
canonical form: hover
sense: 02646990-v
part of speech: verb

linger-v
type: LexicalEntry
canonical form: linger
sense: 02646990-v
part of speech: verb

02646990-v
type: LexicalConcept
in scheme: en-word.net
definition: to hang about in a place beyond the proper or usual time
example: The shy student lingered in the corner
ili: i34874
lexfile: verb.stative
part of speech: verb
hypernym: 02646524-v