remain-v
type: LexicalEntry
canonical form: remain
sense: 02643676-v
part of speech: verb

02643676-v
type: LexicalConcept
in scheme: en-word.net
definition: be left; of persons, questions, problems, results, evidence, etc.
example: There remains the question of who pulled the trigger
example: Carter remains the only President in recent history under whose Presidency the U.S. did not fight a war
ili: i34860
lexfile: verb.stative
part of speech: verb
hypernym: 02609706-v