entail-v
type: LexicalEntry
canonical form: entail
sense: 02640889-v
part of speech: verb

implicate-v
type: LexicalEntry
canonical form: implicate
sense: 02640889-v
part of speech: verb

02640889-v
type: LexicalConcept
in scheme: en-word.net
definition: impose, involve, or imply as a necessary accompaniment or result
example: What does this move entail?
ili: i34846
lexfile: verb.stative
part of speech: verb
hypernym: 02642040-v