govern-v
type: LexicalEntry
canonical form: govern
sense: 02634728-v
part of speech: verb

02634728-v
type: LexicalConcept
in scheme: en-word.net
definition: require to be in a certain grammatical case, voice, or mood
example: most transitive verbs govern the accusative case in German
ili: i34814
lexfile: verb.stative
part of speech: verb
hypernym: 02634015-v