break-v
type: LexicalEntry
canonical form: break
sense: 02631268-v
part of speech: verb

02631268-v
type: LexicalConcept
in scheme: en-word.net
definition: come forth or begin from a state of latency
example: The first winter storm broke over New York
ili: i34797
lexfile: verb.stative
part of speech: verb
hypernym: 02631097-v