come forth-v
type: LexicalEntry
canonical form: come forth
sense: 02631097-v
part of speech: verb

emerge-v
type: LexicalEntry
canonical form: emerge
sense: 02631097-v
part of speech: verb

02631097-v
type: LexicalConcept
in scheme: en-word.net
definition: happen or occur as a result of something
ili: i34796
lexfile: verb.stative
part of speech: verb
hypernym: 02630344-v