bushwhack-v
type: LexicalEntry
canonical form: bushwhack
sense: 02621933-v
part of speech: verb

02621933-v
type: LexicalConcept
in scheme: en-word.net
definition: live in the bush as a fugitive or as a guerilla
ili: i34752
lexfile: verb.stative
part of speech: verb
hypernym: 02620422-v