be-v
type: LexicalEntry
canonical form: be
sense: 02610777-v
part of speech: verb

02610777-v
type: LexicalConcept
in scheme: en-word.net
definition: have the quality of being; (copula, used with an adjective or a predicate noun)
example: John is rich
example: This is not a good answer
ili: i34713
lexfile: verb.stative
part of speech: verb
similar: 90001891-v