address-v
type: LexicalEntry
canonical form: address
sense: 02607453-v
part of speech: verb

call-v
type: LexicalEntry
canonical form: call
sense: 02607453-v
part of speech: verb

02607453-v
type: LexicalConcept
in scheme: en-word.net
definition: greet, as with a prescribed form, title, or name
example: He always addresses me with ‘Sir’
example: Call me Mister
example: She calls him by first name
ili: i34696
lexfile: verb.social
part of speech: verb
hypernym: 00899077-v
similar: 01030757-v