begin-v
type: LexicalEntry
canonical form: begin
sense: 02606945-v
part of speech: verb

start-v
type: LexicalEntry
canonical form: start
sense: 02606945-v
part of speech: verb

02606945-v
type: LexicalConcept
in scheme: en-word.net
definition: begin an event that is implied and limited by the nature or inherent function of the direct object
example: begin a cigar
example: She started the soup while it was still hot
example: We started physics in 10th grade
ili: i34694
lexfile: verb.social
part of speech: verb
hypernym: 02372362-v
similar: 02614858-v