appear-v
type: LexicalEntry
canonical form: appear
sense: 02603759-v
part of speech: verb

02603759-v
type: LexicalConcept
in scheme: en-word.net
definition: present oneself formally, as before a (judicial) authority
example: He had to appear in court last month
example: She appeared on several charges of theft
ili: i34677
lexfile: verb.social
part of speech: verb
hypernym: 02009962-v