work-v
type: LexicalEntry
canonical form: work
sense: 02600976-v
part of speech: verb

02600976-v
type: LexicalConcept
in scheme: en-word.net
definition: operate in a certain place, area, or specialty
example: She works the night clubs
example: The salesman works the Midwest
example: This artist works mostly in acrylics
ili: i34660
lexfile: verb.social
part of speech: verb
hypernym: 02418610-v
similar: 02415985-v