permit-n
type: LexicalEntry
canonical form: permit
sense: 02582559-n
part of speech: noun

Trachinotus falcatus-n
type: LexicalEntry
canonical form: Trachinotus falcatus
sense: 02582559-n
part of speech: noun

02582559-n
type: LexicalConcept
in scheme: en-word.net
definition: large game fish; found in waters of the West Indies
ili: i49252
lexfile: noun.animal
part of speech: noun
hypernym: 02582188-n