run-v
type: LexicalEntry
canonical form: run
sense: 02569242-v
part of speech: verb

execute-v
type: LexicalEntry
canonical form: execute
sense: 02569242-v
part of speech: verb

02569242-v
type: LexicalConcept
in scheme: en-word.net
definition: carry out a process or program, as on a computer or a machine
example: Run the dishwasher
example: run a new program on the Mac
example: the computer executed the instruction
ili: i34507
lexfile: verb.social
part of speech: verb
hypernym: 02565990-v
similar: 01721028-v