support-v
type: LexicalEntry
canonical form: support
sense: 02561834-v
part of speech: verb

back up-v
type: LexicalEntry
canonical form: back up
sense: 02561834-v
part of speech: verb

02561834-v
type: LexicalConcept
in scheme: en-word.net
definition: give moral or psychological support, aid, or courage to
example: She supported him during the illness
example: Her children always backed her up
ili: i34473
lexfile: verb.social
part of speech: verb
hypernym: 02372362-v