sticky-a
type: LexicalEntry
canonical form: sticky
sense: 02561474-s
part of speech: adjective

02561474-s
type: LexicalConcept
in scheme: en-word.net
definition: moist as with undried perspiration and with clothing sticking to the body
example: felt sticky and chilly at the same time
ili: i14150
lexfile: adj.all
part of speech: adjective satellite
similar: https://en-word.net/synset/02558087-a