steaming-a
type: LexicalEntry
canonical form: steaming
sense: 02561287-s
part of speech: adjective

steamy-a
type: LexicalEntry
canonical form: steamy
sense: 02561287-s
part of speech: adjective

02561287-s
type: LexicalConcept
in scheme: en-word.net
definition: filled with steam or emitting moisture in the form of vapor or mist
example: a steaming kettle
example: steamy towels
ili: i14149
lexfile: adj.all
part of speech: adjective satellite
similar: https://en-word.net/synset/02558087-a