nurse-v
type: LexicalEntry
canonical form: nurse
sense: 02556395-v
part of speech: verb

02556395-v
type: LexicalConcept
in scheme: en-word.net
definition: serve as a nurse; care for sick or handicapped people
ili: i34448
lexfile: verb.social
part of speech: verb
hypernym: 02555993-v